Ant Error Target Build Does Not Exist In The Project

Ant - Build.xml

RECOMMENDED: If you have Windows errors then we strongly recommend that you download and run this (Windows) Repair Tool.

Ch02 Target "build.xml" does not exist in the project "build.xml. – Mar 30, 2008 @ 9:22 AM. #2. Re: Ch02 Target "build.xml" does not exist in the project "build.xml". Kaluga you can just type Ant if there is only one build. Also I found I had to change <java classname="com.manning.hq.ch02.EventCalendar" failonerror="true"> to <java classname="com.manning.hq.ch02.

When I run the ant file in verbose mode, I got an error like. Ant build failed: "Target "build. FAILED Target "build.xml" does not exist in the project.

He must discover the inevitable mixture of error and corruption which she contracted. According to the UN, not so much. But science doesn’t exist in an ideal state. Like the arts, it lives on its patrons–and their interests shape its.

Target: This is the real-world object that triggers the digital content to appear. Stage: This is the world that the MR elements exist within. When you open the Start project. Before I do this, though, I’ll first build a component that.

Jun 11, 2009. Target "listener" does not exist in the project "null". Removing " – DGOBUILD_AUTO_COMPONENTS= " eliminated the build failure. If someone can clearly explain why Ant emits such a strange error message in this case (or perhaps why it's not strange if one looks at it correctly), I'll accept your answer.

How exactly does redistricting work, and how did a project like REDMAP play out. drawing the maps in California with not much more than a roadmap and a pen, they were pretty precisely able to target exactly the pockets of voters they.

Eyewitness Error Definition Eyewitness definition, a person who actually sees some act, occurrence, or thing and can give a firsthand account of it: There were two eyewitnesses to the murder. A pair of Texas informatics researchers has come. A fellow witness also spoke about medication errors. Afterward, Sittig said he was approached by an IOM person who asked

I'm using ant.bat (in Ant 1.7.1) to build the all target in a build.xml file, on Windows 2003 Server. (I've substituted "xxx" in the error message for the project.

For those not entirely up on the high-end camera scene these days, here’s a quick catch-up. In an arena that has been dominated by.

Mar 06, 2017  · C++ tutorials, C and C++ news, and information about the C++ IDE Visual Studio from the Microsoft C++ team.

Ant – Users – BUILD FAILED Target "dist" does not exist in. – BUILD FAILED Target "dist" does not exist in the project ". Hi I have written and used an Ant build.xml from Eclipse Europa to create and deploy a WAR file into.

Fatal Error Allowed Memory Size Exhausted Drupal. Allowed Memory Size of 134217728 Bytes Exhausted. In Drupal 7, you can modify the memory limit in the. Fatal error: Allowed memory size of. Eyewitness Error Definition Eyewitness definition, a person who actually sees some act, occurrence, or thing and can give a firsthand account of it: There were two eyewitnesses to the murder.

IBM WebSphere Application Server provides periodic fixes for the base and Network Deployment editions of release V8.5. The following is a complete listing of fixes.

Feb 28, 2011. Eclipse only checks the build.xml when you open them not before (like class files). I would assume that standard-release and compile-jar are not defined in the specified build file, but in some other file? In ANT you can import other build-files and reuse the targets from there:.

Abusing Windows Management Instrumentation (WMI) to Build a Persistent Asynchronous and Fileless Backdoor. Imagine a technology that is.

Target does not exist in project. Hi, We've used Ant for quite a while and I recently checked out a fresh copy of our source code to build on a Windows VM. However.

Error Nonetype Object Has No Attribute Startswith AttributeError: 'NoneType' object has no. AttributeError: 'NoneType' object has no attribute 'startswith'. At least the only way to get this error I know is. AttributeError: 'NoneType' object has no. AttributeError: 'NoneType' object has no attribute 'startswith'. the attribute error because the code is. Flask error: AttributeError: ‘NoneType’ object has. AttributeError: ‘NoneType’ object has no attribute

Anyway, every time I tried to restore or add packages, I got an error message, that told me about an error at the first character in the. specific beta folder won’t.

Jan 21, 2014. You mis-spelt the target name ? 'Clean' as against 'clean' ??

since your ant file's name is build.xml, you should just type ant without ant build. xml. that is: > ant [enter].

RECOMMENDED: Click here to fix Windows errors and improve system performance