Cannot Run Program Gcc Createprocess Error 2

How To Fix git.exe Error in Android Studio in Less than 5 Minutes

RECOMMENDED: If you have Windows errors then we strongly recommend that you download and run this (Windows) Repair Tool.

Cannot run program "dx" CreateProcess error=2, The system cannot find the file specified. 1. Java Cannot run program CreateProcess error=2. 0. java.io.IOException.

Jan 6, 2017. The utility mingw32-make seems to have issues with programs in these directories. If these. Open the command prompt (Start > Run. libgcc_lib process_begin: CreateProcess(NULL, -c "if not exist..libgcc_lib mkdir..lib gcc_lib",) failed. make (e=2): The system cannot find the file specified.

I'm trying to program a Sparkfun Pro Micro 5v and I'm receiving the following compile error when I try to Verify or Upload. Arduino: 1.6.2.

He had most of Jeannette following along and chronicling history as the Jayhawks celebrated the program’s first WPIAL baseball. tacked on three more runs on a bases-loaded balk and a two-run error when the GCC right fielder dropped.

I have a simple program (in C) that create two child process, wait on an inherited pipe each, and put the output in a file. Everything works well, except that after.

Microsoft Point Error Apr 04, 2012  · Excel Solver has worked fine in the past. Recently I tried it on an LP that worked in the previously and I got the following: "run-time error 453" "can’t find dll. As my colleague Woody Leonhard points out. I guess Microsoft can’t keep up this twice-a-year pace either. The problems ranged from

Apr 21, 2015. If you instead get an error saying something like "the sysem cannot find the files specified" it typically means that the GNU toolchain path is set incorrectly. Verify the. C:Program FilesGNU ARM EclipseBuild Tools2.7-201610281058bin C: Program Files (x86)GNU Tools ARM Embedded5.2 2015q4bin.

This is the third part of my USB tutorial for ATtiny2313 and V-USB library. In the second part we got the breadboard setup more or less covered, and now is the time.

Oct 6, 2016. java.io.IOException: Cannot run program "{path}/stlink_upload.bat": CreateProcess error=2, Cannot find specified file i checked in. "C:Users AndreaAppDataLocalArduino15packagesarduinotoolsarm-none-eabi-gcc 4.8.3-2014q1/bin/arm-none-eabi-g++" -Os -Wl,–gc-sections -mcpu=cortex-m4.

No worries, as long as you have gcc. run./configure, make, and make install (make install as root, the rest as normal user). You’ll probably run into a couple of problems during the configuration phase, but again, don’t worry. More than.

Oracle Fusion Middleware Administration – Oracle Help Center – IOException: Cannot run program "C:MW_HOMEInstance_homebinopmnctl": CreateProcess error=2, The system cannot find the file specified. Note the following limitations in cloning Oracle Virtual Directory. When you are cloning Oracle Virtual Directory, the Oracle instance name in the source environment cannot be the.

In this post I will show you how to install Oracle Identity & Access Management 11.1.2.3 and configure Oracle Access Manager and Oracle Identity Manager on Oracle.

Common Weakness Enumeration (CWE) is a list of software weaknesses.

GitHub is home to over 20 million. java.io.IOException: Cannot run program. \xxx/xxx/xxx/xxx"): CreateProcess error=2, The system cannot find the.

Eclipse Community Forums: C / C++ IDE (CDT) » "Can't run. – Cannot run program "gcc" (in directory "D:. CreateProcess error=2, The system cannot find the file specified Error launching external scanner info generator.

When I run my BlackBerry project in Eclipse, I get the following error: Error: Cannot run program "jar": CreateProcess error=2, The system cannot find the file.

RECOMMENDED: Click here to fix Windows errors and improve system performance