Error C2039

Driver Init Error

RECOMMENDED: If you have Windows errors then we strongly recommend that you download and run this (Windows) Repair Tool.

1>stdafx.cpp1>E:Program FilesMicrosoft Visual Studio 9.0VCincludecstdlib(21) : error C2039: ‘div_t’ : is not a member of ‘`global namespace”1>E:Program FilesMicrosoft Visual Studio 9.0VCincludecstdlib(21) : error C2873: ‘div_t’ :.

error C2039: 'mbstate_t' : is not a member of 'std' – Boost Trac – I have been working on the Apache C++ Standard Library project (STDCXX): http ://incubator.apache.org/stdcxx/ I've trying to compile the boost library with.

SOLUTION FOUND: I have researched this issue on the web and it seems like it is something that has been an issue for a lot of people. The solution to this.

I am having problems with a class I am writing. I have split the class into a.h file that defines the class and an.cpp file that implements the class. I receive.

How To Remove Malware Error Nov 17, 2016  · Video embedded  · How can I spot “Error #268D3” virus on my computer? You might be dealing with “Error #268D3” virus if. 2017’s Best Free Malware Removal Software. Find & Remove All Malware Today. Better Protection. Faster Installs. Download Now & Save. Error code: m Once again, this is just a fake message

// C2039.cpp struct S { int mem0; } s, *pS = &s; int main() { pS->mem1 = 0; // C2039 mem1 is not a member pS->mem0 = 0; // OK } C2039 can also occur if you attempt to access a default indexer incorrectly. The following sample defines a.

Just after I include D3DX9.H I get tons of errors. like these: Error 12 error C2039: ‘m’ : is not a member of ‘D3DXMATRIX’ c:program filesmicrosoft directx 9.0 sdk (summer 2004)included3dx9math.inl 1987 1 Aura2 Error 13.

Latex Error Option Clash For Package Ulem I am getting an option clash for babel using: \usepackage[greek,english]{babel}. Here is the output: ! LaTeX Error: Option clash for package babel. Does anyone know. ! LaTeX Error: Option clash for package babel. documentclass. – LaTeX Error: Option clash for package babel. documentclass[article,11pt] {Latex. usepackage[normalem]{ulem} usepackage[greek,english]{babel} usepackage{amsmath} usepackage[postscript]{ucs} usepackage[utf8x]{inputenc} ”’, } That produced a different

Explains that when you try to reference a function from the STD C++ library header , you may receive a C2653 or a C2039 compiler error message. To work.

All rights reserved. sim_andhika_new.c sim_andhika_new_dt.h(51) : error C2039: ‘If_Action_d’ : is not a member of ‘_BlockIO’ sim_andhika_new.h(66) : see declaration of ‘_BlockIO’ sim_andhika_new_dt.h(52) : error C2039:.

Aug 30, 2016. You may be lacking a #include <chrono> at the top of your file. You need this # include in order to have access to the std::chrono namespace.

Compiler Errors C2001 through C2099 Compiler Error C2039. Compiler Error C2039. Compiler Error C2039. Compiler Error C2001. Compiler Error C2002. Compiler Error C2003.

Nov 07, 2002  · Hello. I know this is a newbie question, but it is my first time using MFC. I want to change the bitmap isplayed in a CStatic control at runtime by.

Nov 19, 2013. As the error says, you're trying to call countDupes on a node, which has no such member. Although you didn't point out which lines of the large.

RE: FILE structure internals issue building blead on Windows withVisual Studio 2015 RC by bulk 88 Re: FILE structure internals issue building blead on Windows withVisual Studio 2015 RC by A. Sinan Unur Re: FILE.

1. error C2039: ‘exception’ : is not a member of ‘`global namespace” 2. error C2039: ‘exception’ : is not a member of ‘`global namespace” 3. error C2039: ‘InlineIsEqualGUID’ : is not a member of ‘ATL’ 4. error C2039:.

I just encountered a weird error which saying that find is not a member of std. error C2039: 'find' : is not a member of 'std' error C3861: 'find': identifier not.

Building Python 3.3.4 with Visual Studio 2013. 4th revision, April 12, 2014. A document history can be found at the very end of this page. Downloads

I'm trying to do conversions between Filetime and Systemtime and I'm getting an Error C2039 that OneMinuteAgo is not a meber of class.

Quite simply, you cannot have two overloaded functions that have the same parameter list and only differ with the return type. The solution is simple: make.

Apr 1, 2015. As my comment stated above, the error does show up in the Visual Studio output window, you just didn't see it (for some reason). The error.

I was trying to learn DLLs and nothing was really explaining anything; it was just code for you to look at and wonder what was going on. For this article, I assume.

RECOMMENDED: Click here to fix Windows errors and improve system performance