Error Lnk2019 Unresolved External Symbol _cvloadimage

RECOMMENDED: If you have Windows errors then we strongly recommend that you download and run this (Windows) Repair Tool.

Mar 24, 2015. error LNK2019: unresolved external symbol _cvLoadImage referenced in function _main 1>main.obj : error LNK2019: unresolved external.

opencv – LNK2019: unresolved external symbol error in Visual. – Jul 21, 2013. 'unresolved external symbol' means that You're not linking with required library. Go to properties->linker->additional library dependencies and.

Game Error 11 Georgia State – The Jaguars never established any rhythm offensively, and managed only a pair. If you are receiving this error in any program, you need to delete from the system, reboot your system. When two teams are evenly matched, there’s a small margin for error between. Battle it out for ring domination in the

. error LNK2019: unresolved external symbol. unresolved external symbol _cvLoadImage. LNK2019: Error. unresolved external symbol in C++.

OpenCv error :unresolved external symbol(链接库没有加上. – 2012年5月13日. error LNK2001: unresolved external symbol _cvDestroyWindow : error LNK2001: unresolved external symbol _cvLoadImage : error LNK2001:.

error LNK2019: unresolved external symbol fun referenced in function main. VC++2008 error LNK2019: unresolved external symbol [email protected] referenced.

. unresolved external symbol _cvLoadImage C:. How do I read an unresolved external symbol error in Visual. Error LNK2019: Unresolved External Symbol in.

why show error "mainwindow.obj:-1: error: LNK2019: unresolved. – why show error "mainwindow.obj:-1: error: LNK2019: unresolved external symbol _cvLoadImage referenced in function "private: void __thiscall.

. unresolved external symbol _cvLoadImage referenced in function _wlan_hcf_completed. error LNK2019: unresolved external symbol _cvReleaseImage referenced in.

1>vasir.lib(CreateTemplate.obj) : error LNK2001: unresolved external symbol cvCloneImage 1>vasir.lib(FindEyelidMix.obj) : error LNK2001:.

Apr 2, 2013. I found the solution. VS2012 is glitched. I thought my project was set to x64, because when I clicked on Build -> Configuration Manager.

RECOMMENDED: Click here to fix Windows errors and improve system performance