Libinstall Error 1

Fix Cydia Error Messages iOS 9.3.3 - 10.2 Jailbreak

RECOMMENDED: If you have Windows errors then we strongly recommend that you download and run this (Windows) Repair Tool.

make: [install-libs] Error 1 (ignored). mkdir: cannot create directory `/usr/bin/hyperion': Not a directory.

If you've got Libinstall Error 1 error then we suggest that you perform an error scan. The following document contains advice that will show you how to successfully treat any Windows Libinstall Error.

Compiling /usr/local/lib/python2.7/zipfile.py. make: *** [libinstall] Error 1. Here is some piece of the console output: http.

.module)",) [snip] Compiling /usr/lib/python2.5/zipfile.py. make: *** [libinstall] Error 1. However, after a 'make -i install' to force make to continue despite the error, unicodedata.so was there.

Compiling Usr Local Lib Python2 7 Zipfile Py. Makefile:894: recipe for target 'libinstall' failed make: [libinstall] Error 1 (ignored) PYTHONPATH=/home/paul.

Error 504 Gateway Timeout Mikrotik ERROR: Gateway Timeout with proxy – MikroTik – Generated Sat, 13 Sep 2008 08:31:24 GMT by 10.8.15.99 (Mikrotik HttpProxy) I get this error only when I enable web proxy. ERROR: Gateway Timeout with proxy. A 504 Gateway Timeout error means that one server involved in displaying the web page did not communicate to another one

Oct 7, 2015. bin/[agm]* /users/lm15898/OpenFOAM/ThirdParty-2.3.0/platforms/linux64Gcc48/ scotch_6.0.0/bin cp -f./bin/d[agm]* /users/lm15898/OpenFOAM/ThirdParty-2.3.0/ platforms/linux64Gcc48/scotch_6.0.0/bin cp: cannot stat `./bin/d[agm]*': No such file or directory make: [install] Error 1 (ignored). Last Error. Code:.

Feb 4, 2011. File “/home/arm_install/lib/python2.7/compileall.py”, line 17, in import struct. File “/ home/arm_install/lib/python2.7/struct.py”, line 1, in from _struct import * ImportError: /u02/python_crosscompile/Python-2.7.1/build/lib.linux-x86_64-2.7/_ struct.so: wrong ELF class: ELFCLASS32 make: *** [libinstall] Error 1.

. "/home/smp383/mips-4.3/bin/testpython/Python-2.7.1/cawanpython/usr/local/lib / python2.7/struct.py", line 1, in <module> from _struct import * ImportError: /home/ smp383/mips-4.3/bin/testpython/Python-2.7.1/build/lib.linux-i686-2.7/ _struct.so: cannot open shared object file: No such file or directory make: *** [libinstall] Error.

Home > install python > zipfile.py libinstall error 1 Zipfile.py Libinstall Error 1. and get tips compiling usr local lib python2 7 zipfile py & solutions from a.

Python Dies on "make install" – Python – Aug 10, 2007  · Python Dies on "make install". Python Forums on Bytes. 421,565 Members | 1,168 Online. make: *** [libinstall] Error 1 I am currently trying to install 2.5.1.

Feb 9, 2015. 16:16:22 UTC #1. I am current trying to running apm install –check behind a corporate proxy to see if I have the build tools installed correctly. However I am getting the following error: Checking for native build tools C:Userschaines AppDataLocalatomapp-0.177.0resourcesappapmlibinstall.js:77.

Grub Loading Error 18 Linux View and Download Red Hat LINUX 7.2 reference manual online. LINUX 7.2 pdf manual download. grub+error+17. will write grub to the sdb. 02:18. Linux. Just to add, I had to amend the grub.cfg file. Grub Loading, Please Wait.Error 18. Knowing this allows you to focus your troubleshooting efforts based on where in the process

Aug 10, 2007  · Python Dies on "make install". Python Forums on Bytes. 421,565 Members | 1,168 Online. make: *** [libinstall] Error 1 I am currently trying to install 2.5.1.

2016年5月13日. 说明: 这一步,很多博客或教程,给的都是make install ,我试了,报错make: *** [ libinstall] Error 1, 参考了http://bugs.python.org/issue1669349,用maike -i install 成功。 7、make clean. 8、make distclean. 9、#备份老python mv /usr/bin/python / usr/bin/python2.7.6. #建立软连接ln -s /usr/local/bin/python2.7 /usr/bin/.

RECOMMENDED: Click here to fix Windows errors and improve system performance