Non_object_property_load Error

RECOMMENDED: If you have Windows errors then we strongly recommend that you download and run this (Windows) Repair Tool.

Error Id 3019 More about net framework installation error. maxwell1830. http://www.microsoft. com/en-us/download/details.aspx?id=17718. And search for. Design and fall Progress in the field has also been slow. Several of these treatments, including Biogen’s STX-100 and Fibrogen’s FG-3019, have remained in phase II since EP Vantage last reviewed this space in early 2012, having. Error 3019 problems include computer crashes,

javascript – What does TypeError non_object_property_load. – I see this error a bunch in javascript that I'm debugging. In the JS console Chrome says something very similar to TypeError arguments: Array[2] message.

Sep 17, 2010. Ideally you should just send out an error email and perform a graceful restart of your service whenever you hit an uncaught exception. Why?

I keep getting the following error on one of my menu pages: otice: Trying to get property of non-object in /home/mywebsite/public_html/wp-content/plugins/ajax-load.

Error.500.message Handle HTTP 500 errors – ServiceNow Docs – The HTTP 500 error is a generic error message that Internet Explorer passes to you when your web site errors for one reason or another, but it provides no. This is YouTube’s 500 page. Can anyone help decode this information? <p>500 Internal Server Error<p> Sorry, something went

How To Fix Object Error. Very Simple Instructions (Recommended)

less.js-middleware – Connect Middleware for LESS.js compiling

Started getting a compiling error in versions 0.10 and. as "non_object_property_loadError. non_object_property_loadError: Cannot read property 'rules' of.

Npm update no longer works in newest version · Issue #6110. – Aug 22, 2013. npm ERR! cwd /Users/skinney/Workspace/ffa npm ERR! node -v v0.10.17 npm ERR! npm -v 1.3.8 npm ERR! type non_object_property_load

Mar 31, 2014. 5760 error node -v v0.10.3 5761 error npm -v 1.2.17 5762 error type non_object_property_load 5763 verbose exit [ 1, true ].

Dec 23, 2014. Hey, I've never seen this error before, but can you try updating your. 54 error npm -v 1.4.28 55 error type non_object_property_load 56.

Capital Punishment Error Rate Out Of Office Assistant Error Ms Outlook Windows Error 157 DLink ErrorID 734 Solved in Windows 7 and 8. D-Link DWP 157 Wireless 3G Data Modem installation issue on Windows 10 solved – Duration: 3:19. Have made some modification: add DNS support(Not fully tested) and remove some error codes(when delete) Code/ #cs After her death

Oct 12, 2011. You're trying to access something from null or undefined. For example, this code will throw such an error: null.foo;. You should check which.

RECOMMENDED: Click here to fix Windows errors and improve system performance